{"text_format":"1","workbook":"xlsx","n_sheets":2,"sheets":["EDF","Validation sheet"],"not_rendered":{"charts":0,"images":0,"macros":0,"external_links":0,"defined_names":6,"comments":0,"pivot_tables":0},"unopened":[],"bounds":{"document_bytes":16777216,"sheet_cells":100000,"rows_first":2000,"rows_last":500,"rows_between":2000,"halvings":0,"cell_chars":16384,"cell_head_chars":4096},"cells_cut":0,"cells_raw":0,"read":"whole","date_system":"1900"}

{"sheet":"EDF","index":0,"n_rows":1000,"n_cols":38,"rows_kept":1000,"cut":false,"hidden":false,"merged":[[4,7,4,9],[4,14,4,16],[4,32,4,34]]}
["Company Name","ARKAN GULF TRADING & CONTRACTING",null,"V10.3"]
["Date : ",{"$f":"NOW()","v":"2024-09-11T11:06:02.850"}]
["Time :",{"$f":"NOW()","v":45546.462532986108}]
["Batch Number : "]
["Computer Card Number ","15457600",null,null,null,null,null,"Date of Birth ",null,null,null,null,null,null,"Expiry Date ",null,null,null,null,null,null,null,null,null,null,null,null,null,null,null,null,null,"Visa Expiry Date "]
["Staff Number","First Name ","Middle Name ","Last Name ","Name on Card","Nationality","Nationality","Day","Month ","Year","Date of Birth","Country Of Birth","Type ","ID No / Passport No","Day","Month ","Year","ID Expiry Date","Prefix (delete)","Mobile No","Mobile No","Company  Address","Work City ","Home Country Address","Sector","Company Name","Employment Date","Monthly Income","Level of Education / Occupation","MOBILE ALERTS REQUEST","Visa Type","Visa Number","Day","Month ","Year","Salary Range","Place of Birth(City)","Job Title#"]
[6,"Muhammad","Ahmad","Ali",{"$f":"B7&\" \"&D7","v":"Muhammad Ali"},"PAKISTAN",{"$f":"VLOOKUP(F7,'Validation sheet'!E:F,2,FALSE)","v":"PK"},"07","12",1996,{"$f":"H7&\"-\"&I7&\"-\"&J7","v":"07-12-1996"},{"$f":"G7","v":"PK"},"QATAR ID",29658603198,"20","02",2025,{"$f":"O7&\"-\"&P7&\"-\"&Q7","v":"20-02-2025"},null,66808817,{"$f":"S7&T7","v":"66808817"},"Zone 00 Street 00 Building 00","Al Wakrah",{"$f":"L7","v":"PK"},null,{"$f":"$B$1","v":"ARKAN GULF TRADING & CONTRACTING"},{"$f":"NOW()","v":"2024-09-11T11:06:02.850"},null,"Payroll Service (Worker)","Y","Work Visa",null,null,null,null,null,"PAKISTAN","HVAC"]
[null,null,null,null,{"$f":"B8&\" \"&D8","v":" "},null,{"$f":"VLOOKUP(F8,'Validation sheet'!E:F,2,FALSE)","v":{"$error":"#N/A"}},null,null,null,{"$f":"H8&\"-\"&I8&\"-\"&J8","v":"--"},{"$f":"G8","v":{"$error":"#N/A"}},null,null,null,null,null,{"$f":"O8&\"-\"&P8&\"-\"&Q8","v":"--"},null,null,"","Zone 00 Street 00 Building 00",null,{"$error":"#N/A"},null,{"$f":"$B$1","v":"ARKAN GULF TRADING & CONTRACTING"},{"$f":"NOW()","v":"2024-09-11T11:06:02.850"},null,"Payroll Service (Worker)","Y","Work Visa"]
[null,null,null,null," ",null,{"$f":"VLOOKUP(F9,'Validation sheet'!E:F,2,FALSE)","v":{"$error":"#N/A"}},null,null,null,"--",{"$error":"#N/A"},null,null,null,null,null,"--",null,null,"","Zone 00 Street 00 Building 00",null,{"$error":"#N/A"},null,"ARKAN GULF TRADING & CONTRACTING","2024-09-11T11:06:02.850",null,"Payroll Service (Worker)","Y","Work Visa"]
[null,null,null,null," ",null,{"$f":"VLOOKUP(F10,'Validation sheet'!E:F,2,FALSE)","v":{"$error":"#N/A"}},null,null,null,"--",{"$error":"#N/A"},null,null,null,null,null,"--",null,null,"","Zone 00 Street 00 Building 00",null,{"$error":"#N/A"},null,"ARKAN GULF TRADING & CONTRACTING","2024-09-11T11:06:02.850",null,"Payroll Service (Worker)","Y","Work Visa"]
[null,null,null,null," ",null,{"$f":"VLOOKUP(F11,'Validation sheet'!E:F,2,FALSE)","v":{"$error":"#N/A"}},null,null,null,"--",{"$error":"#N/A"},null,null,null,null,null,"--",null,null,"","Zone 00 Street 00 Building 00",null,{"$error":"#N/A"},null,"ARKAN GULF TRADING & CONTRACTING","2024-09-11T11:06:02.850",null,"Payroll Service (Worker)","Y","Work Visa"]
[null,null,null,null," ",null,{"$f":"VLOOKUP(F12,'Validation sheet'!E:F,2,FALSE)","v":{"$error":"#N/A"}},null,null,null,"--",{"$error":"#N/A"},null,null,null,null,null,"--",null,null,"","Zone 00 Street 00 Building 00",null,{"$error":"#N/A"},null,"ARKAN GULF TRADING & CONTRACTING","2024-09-11T11:06:02.850",null,"Payroll Service (Worker)","Y","Work Visa"]
[null,null,null,null," ",null,{"$f":"VLOOKUP(F13,'Validation sheet'!E:F,2,FALSE)","v":{"$error":"#N/A"}},null,null,null,"--",{"$error":"#N/A"},null,null,null,null,null,"--",null,null,"","Zone 00 Street 00 Building 00",null,{"$error":"#N/A"},null,"ARKAN GULF TRADING & CONTRACTING","2024-09-11T11:06:02.850",null,"Payroll Service (Worker)","Y","Work Visa"]
[null,null,null,null," ",null,{"$f":"VLOOKUP(F14,'Validation sheet'!E:F,2,FALSE)","v":{"$error":"#N/A"}},null,null,null,"--",{"$error":"#N/A"},null,null,null,null,null,"--",null,null,"","Zone 00 Street 00 Building 00",null,{"$error":"#N/A"},null,"ARKAN GULF TRADING & CONTRACTING","2024-09-11T11:06:02.850",null,"Payroll Service (Worker)","Y","Work Visa"]
[null,null,null,null," ",null,{"$f":"VLOOKUP(F15,'Validation sheet'!E:F,2,FALSE)","v":{"$error":"#N/A"}},null,null,null,"--",{"$error":"#N/A"},null,null,null,null,null,"--",null,null,"","Zone 00 Street 00 Building 00",null,{"$error":"#N/A"},null,"ARKAN GULF TRADING & CONTRACTING","2024-09-11T11:06:02.850",null,"Payroll Service (Worker)","Y","Work Visa"]
[null,null,null,null," ",null,{"$f":"VLOOKUP(F16,'Validation sheet'!E:F,2,FALSE)","v":{"$error":"#N/A"}},null,null,null,"--",{"$error":"#N/A"},null,null,null,null,null,"--",null,null,"","Zone 00 Street 00 Building 00",null,{"$error":"#N/A"},null,"ARKAN GULF TRADING & CONTRACTING","2024-09-11T11:06:02.850",null,"Payroll Service (Worker)","Y","Work Visa"]
[null,null,null,null," ",null,{"$f":"VLOOKUP(F17,'Validation sheet'!E:F,2,FALSE)","v":{"$error":"#N/A"}},null,null,null,"--",{"$error":"#N/A"},null,null,null,null,null,"--",null,null,"","Zone 00 Street 00 Building 00",null,{"$error":"#N/A"},null,"ARKAN GULF TRADING & CONTRACTING","2024-09-11T11:06:02.850",null,"Payroll Service (Worker)","Y","Work Visa"]
[null,null,null,null," ",null,{"$f":"VLOOKUP(F18,'Validation sheet'!E:F,2,FALSE)","v":{"$error":"#N/A"}},null,null,null,"--",{"$error":"#N/A"},null,null,null,null,null,"--",null,null,"","Zone 00 Street 00 Building 00",null,{"$error":"#N/A"},null,"ARKAN GULF TRADING & CONTRACTING","2024-09-11T11:06:02.850",null,"Payroll Service (Worker)","Y","Work Visa"]
[null,null,null,null," ",null,{"$f":"VLOOKUP(F19,'Validation sheet'!E:F,2,FALSE)","v":{"$error":"#N/A"}},null,null,null,"--",{"$error":"#N/A"},null,null,null,null,null,"--",null,null,"","Zone 00 Street 00 Building 00",null,{"$error":"#N/A"},null,"ARKAN GULF TRADING & CONTRACTING","2024-09-11T11:06:02.850",null,"Payroll Service (Worker)","Y","Work Visa"]
[null,null,null,null," ",null,{"$f":"VLOOKUP(F20,'Validation sheet'!E:F,2,FALSE)","v":{"$error":"#N/A"}},null,null,null,"--",{"$error":"#N/A"},null,null,null,null,null,"--",null,null,"","Zone 00 Street 00 Building 00",null,{"$error":"#N/A"},null,"ARKAN GULF TRADING & CONTRACTING","2024-09-11T11:06:02.850",null,"Payroll Service (Worker)","Y","Work Visa"]
[null,null,null,null," ",null,{"$f":"VLOOKUP(F21,'Validation sheet'!E:F,2,FALSE)","v":{"$error":"#N/A"}},null,null,null,"--",{"$error":"#N/A"},null,null,null,null,null,"--",null,null,"","Zone 00 Street 00 Building 00",null,{"$error":"#N/A"},null,"ARKAN GULF TRADING & CONTRACTING","2024-09-11T11:06:02.850",null,"Payroll Service (Worker)","Y","Work Visa"]
[null,null,null,null," ",null,{"$f":"VLOOKUP(F22,'Validation sheet'!E:F,2,FALSE)","v":{"$error":"#N/A"}},null,null,null,"--",{"$error":"#N/A"},null,null,null,null,null,"--",null,null,"","Zone 00 Street 00 Building 00",null,{"$error":"#N/A"},null,"ARKAN GULF TRADING & CONTRACTING","2024-09-11T11:06:02.850",null,"Payroll Service (Worker)","Y","Work Visa"]
[null,null,null,null," ",null,{"$f":"VLOOKUP(F23,'Validation sheet'!E:F,2,FALSE)","v":{"$error":"#N/A"}},null,null,null,"--",{"$error":"#N/A"},null,null,null,null,null,"--",null,null,"","Zone 00 Street 00 Building 00",null,{"$error":"#N/A"},null,"ARKAN GULF TRADING & CONTRACTING","2024-09-11T11:06:02.850",null,"Payroll Service (Worker)","Y","Work Visa"]
[null,null,null,null," ",null,{"$f":"VLOOKUP(F24,'Validation sheet'!E:F,2,FALSE)","v":{"$error":"#N/A"}},null,null,null,"--",{"$error":"#N/A"},null,null,null,null,null,"--",null,null,"","Zone 00 Street 00 Building 00",null,{"$error":"#N/A"},null,"ARKAN GULF TRADING & CONTRACTING","2024-09-11T11:06:02.850",null,"Payroll Service (Worker)","Y","Work Visa"]
[null,null,null,null," ",null,{"$f":"VLOOKUP(F25,'Validation sheet'!E:F,2,FALSE)","v":{"$error":"#N/A"}},null,null,null,"--",{"$error":"#N/A"},null,null,null,null,null,"--",null,null,"","Zone 00 Street 00 Building 00",null,{"$error":"#N/A"},null,"ARKAN GULF TRADING & CONTRACTING","2024-09-11T11:06:02.850",null,"Payroll Service (Worker)","Y","Work Visa"]
[null,null,null,null," ",null,{"$f":"VLOOKUP(F26,'Validation sheet'!E:F,2,FALSE)","v":{"$error":"#N/A"}},null,null,null,"--",{"$error":"#N/A"},null,null,null,null,null,"--",null,null,"","Zone 00 Street 00 Building 00",null,{"$error":"#N/A"},null,"ARKAN GULF TRADING & CONTRACTING","2024-09-11T11:06:02.850",null,"Payroll Service (Worker)","Y","Work Visa"]
[null,null,null,null," ",null,{"$f":"VLOOKUP(F27,'Validation sheet'!E:F,2,FALSE)","v":{"$error":"#N/A"}},null,null,null,"--",{"$error":"#N/A"},null,null,null,null,null,"--",null,null,"","Zone 00 Street 00 Building 00",null,{"$error":"#N/A"},null,"ARKAN GULF TRADING & CONTRACTING","2024-09-11T11:06:02.850",null,"Payroll Service (Worker)","Y","Work Visa"]
[null,null,null,null," ",null,{"$f":"VLOOKUP(F28,'Validation sheet'!E:F,2,FALSE)","v":{"$error":"#N/A"}},null,null,null,"--",{"$error":"#N/A"},null,null,null,null,null,"--",null,null,"","Zone 00 Street 00 Building 00",null,{"$error":"#N/A"},null,"ARKAN GULF TRADING & CONTRACTING","2024-09-11T11:06:02.850",null,"Payroll Service (Worker)","Y","Work Visa"]
[null,null,null,null," ",null,{"$f":"VLOOKUP(F29,'Validation sheet'!E:F,2,FALSE)","v":{"$error":"#N/A"}},null,null,null,"--",{"$error":"#N/A"},null,null,null,null,null,"--",null,null,"","Zone 00 Street 00 Building 00",null,{"$error":"#N/A"},null,"ARKAN GULF TRADING & CONTRACTING","2024-09-11T11:06:02.850",null,"Payroll Service (Worker)","Y","Work Visa"]
[null,null,null,null," ",null,{"$f":"VLOOKUP(F30,'Validation sheet'!E:F,2,FALSE)","v":{"$error":"#N/A"}},null,null,null,"--",{"$error":"#N/A"},null,null,null,null,null,"--",null,null,"","Zone 00 Street 00 Building 00",null,{"$error":"#N/A"},null,"ARKAN GULF TRADING & CONTRACTING","2024-09-11T11:06:02.850",null,"Payroll Service (Worker)","Y","Work Visa"]
[null,null,null,null," ",null,{"$f":"VLOOKUP(F31,'Validation sheet'!E:F,2,FALSE)","v":{"$error":"#N/A"}},null,null,null,"--",{"$error":"#N/A"},null,null,null,null,null,"--",null,null,"","Zone 00 Street 00 Building 00",null,{"$error":"#N/A"},null,"ARKAN GULF TRADING & CONTRACTING","2024-09-11T11:06:02.850",null,"Payroll Service (Worker)","Y","Work Visa"]
[null,null,null,null," ",null,{"$f":"VLOOKUP(F32,'Validation sheet'!E:F,2,FALSE)","v":{"$error":"#N/A"}},null,null,null,"--",{"$error":"#N/A"},null,null,null,null,null,"--",null,null,"","Zone 00 Street 00 Building 00",null,{"$error":"#N/A"},null,"ARKAN GULF TRADING & CONTRACTING","2024-09-11T11:06:02.850",null,"Payroll Service (Worker)","Y","Work Visa"]
[null,null,null,null," ",null,{"$f":"VLOOKUP(F33,'Validation sheet'!E:F,2,FALSE)","v":{"$error":"#N/A"}},null,null,null,"--",{"$error":"#N/A"},null,null,null,null,null,"--",null,null,"","Zone 00 Street 00 Building 00",null,{"$error":"#N/A"},null,"ARKAN GULF TRADING & CONTRACTING","2024-09-11T11:06:02.850",null,"Payroll Service (Worker)","Y","Work Visa"]
[null,null,null,null," ",null,{"$f":"VLOOKUP(F34,'Validation sheet'!E:F,2,FALSE)","v":{"$error":"#N/A"}},null,null,null,"--",{"$error":"#N/A"},null,null,null,null,null,"--",null,null,"","Zone 00 Street 00 Building 00",null,{"$error":"#N/A"},null,"ARKAN GULF TRADING & CONTRACTING","2024-09-11T11:06:02.850",null,"Payroll Service (Worker)","Y","Work Visa"]
[null,null,null,null," ",null,{"$f":"VLOOKUP(F35,'Validation sheet'!E:F,2,FALSE)","v":{"$error":"#N/A"}},null,null,null,"--",{"$error":"#N/A"},null,null,null,null,null,"--",null,null,"","Zone 00 Street 00 Building 00",null,{"$error":"#N/A"},null,"ARKAN GULF TRADING & CONTRACTING","2024-09-11T11:06:02.850",null,"Payroll Service (Worker)","Y","Work Visa"]
[null,null,null,null," ",null,{"$f":"VLOOKUP(F36,'Validation sheet'!E:F,2,FALSE)","v":{"$error":"#N/A"}},null,null,null,"--",{"$error":"#N/A"},null,null,null,null,null,"--",null,null,"","Zone 00 Street 00 Building 00",null,{"$error":"#N/A"},null,"ARKAN GULF TRADING & CONTRACTING","2024-09-11T11:06:02.850",null,"Payroll Service (Worker)","Y","Work Visa"]
[null,null,null,null," ",null,{"$f":"VLOOKUP(F37,'Validation sheet'!E:F,2,FALSE)","v":{"$error":"#N/A"}},null,null,null,"--",{"$error":"#N/A"},null,null,null,null,null,"--",null,null,"","Zone 00 Street 00 Building 00",null,{"$error":"#N/A"},null,"ARKAN GULF TRADING & CONTRACTING","2024-09-11T11:06:02.850",null,"Payroll Service (Worker)","Y","Work Visa"]
[null,null,null,null," ",null,{"$f":"VLOOKUP(F38,'Validation sheet'!E:F,2,FALSE)","v":{"$error":"#N/A"}},null,null,null,"--",{"$error":"#N/A"},null,null,null,null,null,"--",null,null,"","Zone 00 Street 00 Building 00",null,{"$error":"#N/A"},null,"ARKAN GULF TRADING & CONTRACTING","2024-09-11T11:06:02.850",null,"Payroll Service (Worker)","Y","Work Visa"]
[null,null,null,null," ",null,{"$f":"VLOOKUP(F39,'Validation sheet'!E:F,2,FALSE)","v":{"$error":"#N/A"}},null,null,null,"--",{"$error":"#N/A"},null,null,null,null,null,"--",null,null,"","Zone 00 Street 00 Building 00",null,{"$error":"#N/A"},null,"ARKAN GULF TRADING & CONTRACTING","2024-09-11T11:06:02.850",null,"Payroll Service (Worker)","Y","Work Visa"]
[null,null,null,null," ",null,{"$f":"VLOOKUP(F40,'Validation sheet'!E:F,2,FALSE)","v":{"$error":"#N/A"}},null,null,null,"--",{"$error":"#N/A"},null,null,null,null,null,"--",null,null,"","Zone 00 Street 00 Building 00",null,{"$error":"#N/A"},null,"ARKAN GULF TRADING & CONTRACTING","2024-09-11T11:06:02.850",null,"Payroll Service (Worker)","Y","Work Visa"]
{"$rows_left_out":961}
{"sheet":"Validation sheet","index":1,"n_rows":243,"n_cols":17,"rows_kept":243,"cut":false,"hidden":true,"merged":[]}
[null,null,null,null,"Country",null,null,null,null,"City",null,"Day","Month","Year","Year",null,"Madinat ash Shamal"]
[null,"QATAR ID","Business Visa",null,"AFGHANISTAN","AF",null,"Agriculture",null,"Doha",null,"01","01",1940,2024,null,"Al Khor"]
[null,"PASSPORT","Work Visa",null,"ALBANIA","AL",null,"BankingandFinance",null,"Wakra",null,"02","02",{"$f":"SUM(N2)+1","v":1941},2025,null,"Umm Salal"]
[null,null,null,null,"ALGERIA","DZ",null,"Construction",null,"Mesaieed",null,"03","03",{"$f":"SUM(N3)+1","v":1942},2026,null,"Al Daayen"]
[null,null,null,null,"AMERICAN SAMOA","AS",null,"Corporate",null,"Dukhan",null,"04","04",1943,2027,null,"Ar Rayyan"]
[null,null,null,null,"ANDORRA","AD",null,"EducationandTraining",null,"Khor",null,"05","05",1944,2028,null,"Ad Dawhah Doha"]
[null,null,null,null,"ANGOLA","AO",null,"Energy",null,"Other",null,"06","06",1945,2029,null,"Al Wakrah"]
[null,null,null,null,"ANGUILLA","AI",null,"Government",null,null,null,"07","07",1946,2030,null,"Shahaniya"]
[null,null,null,"Less than 1000","ANTARCTICA","AQ",null,"Healthcare",null,null,null,"08","08",1947,2031]
[null,null,null,"1000 to 2000","ANTIGUA AND BARBUDA","AG",null,"Hospitality",null,null,null,"09","09",1948,2032]
[null,{"$f":"260*600","v":156000},null,"2000 to 5000","ARGENTINA","AR",null,"ITandTelecommunication",null,null,null,"10","10",1949,2033]
[null,null,null,"5000 to 10000","ARMENIA","AM",null,"Legal",null,null,null,"11","11",1950,2034]
[null,null,null,"10000 to 15000","ARUBA","AW",null,"Manufacturing",null,null,null,"12","12",1951,2035]
[null,null,null,"15000 to 20000","AUSTRALIA","AU",null,"MediaandEntertainment",null,null,null,"13",null,1952,2036]
[null,null,null,"20000 to 30000","AUSTRIA","AT",null,"NGO",null,null,null,"14",null,1953,2037]
[null,null,null,"Greater than 30000","AZERBAIJAN","AZ",null,"Retail",null,null,null,"15",null,1954,2038]
[null,null,null,null,"BAHAMAS","BS",null,"Security",null,null,null,"16",null,1955,2039]
[null,null,null,null,"BAHRAIN","BH",null,"TourismandTravel",null,null,null,"17",null,1956,2040]
[null,null,null,null,"BANGLADESH","BD",null,null,null,null,null,"18",null,1957,2041]
[null,null,null,null,"BARBADOS","BB",null,null,null,null,null,"19",null,1958,2042]
[null,null,null,null,"BELARUS","BY",null,null,"Government Sector",null,null,"20",null,1959]
[null,null,null,null,"BELGIUM","BE",null,null,"Business",null,null,"21",null,1960]
[null,null,null,null,"BELIZE","BZ",null,null,"Housewife",null,null,"22",null,1961]
[null,null,null,null,"BENIN","BJ",null,null,"Payroll Service (Worker)",null,null,"23",null,1962]
[null,null,null,null,"BERMUDA","BM",null,null,"Private Sector",null,null,"24",null,1963]
[null,null,null,null,"BHUTAN","BT",null,null,"Professional",null,null,"25",null,1964]
[null,null,null,null,"BOLIVIA","BO",null,null,"Public Sector",null,null,"26",null,1965]
[null,null,null,null,"BOSNIA AND HERZEGOWINA","BA",null,null,"Retired",null,null,"27",null,1966]
[null,null,null,null,"BOTSWANA","BW",null,null,"Self Employed",null,null,"28",null,1967]
[null,null,null,null,"BOUVET ISLAND","BV",null,null,"Service Sector",null,null,"29",null,1968]
[null,null,null,null,"BRAZIL","BR",null,null,"Student",null,null,"30",null,1969]
[null,null,null,null,"BRITISH INDIAN OCEAN TERRITORY","IO",null,null,null,null,null,"31",null,1970]
[null,null,null,null,"BRUNEI DARUSSALAM","BN",null,null,null,null,null,null,null,1971]
[null,null,null,null,"BULGARIA","BG",null,null,null,null,null,null,null,1972]
[null,null,null,null,"BURKINA FASO","BF",null,null,null,null,null,null,null,1973]
[null,null,null,null,"BURUNDI","BI",null,null,null,null,null,null,null,1974]
[null,null,null,null,"CAMBODIA","KH",null,null,null,null,null,null,null,1975]
[null,null,null,null,"CAMEROON","CM",null,null,null,null,null,null,null,1976]
[null,null,null,null,"CANADA","CA",null,null,null,null,null,null,null,1977]
[null,null,null,null,"CAPE VERDE","CV",null,null,null,null,null,null,null,1978]
{"$rows_left_out":203}